Error failed find flength file trabalhos

Filtro

Minhas pesquisas recentes
Filtrar por:
Orçamento
para
para
para
Tipo
Habilidades
Idiomas
    Estado do Trabalho
    484 error failed find flength file trabalhos encontrados, preços em EUR

    I switched from eclipse to studio. I imported a project in Android studio. I am unable to fix error gradle sync failed error

    €20 (Avg Bid)
    €20 Média
    23 ofertas

    Seeking expert legal advice for a failed web project. I enlisted and signed a contract with a company based in India to deliver a web and application based site. Nearly 18 mths later we have a first phase website that has been riddled with errors and bugs and still no applications for delivery. We are no longer receiving responses from the development

    €543 (Avg Bid)
    €543 Média
    12 ofertas

    I have a Rails app which need to Fix ERROR password authentication failed for user "postgres" $ rails s failed to read test/fixtures/..: Is a directory @ io_fillbuf - fd:11 test/fixtures/.. failed to read test/fixtures/.: Is a directory @ io_fillbuf - fd:12 test/fixtures/. => Booting WEBrick => Rails 4.2.7.1 application starting in development on

    €11 / hr (Avg Bid)
    €11 / hr Média
    8 ofertas

    ...restart Job for [fazer login para ver a URL] failed. See 'systemctl status [fazer login para ver a URL]' and 'journalctl -xn' for details. # systemctl status [fazer login para ver a URL] ● [fazer login para ver a URL] - LSB: Apache2 web server Loaded: loaded (/etc/init.d/apache2) Drop-In: /lib/systemd/system/apache2.service.d └─[fazer login para ver a ...

    €49 (Avg Bid)
    €49 Média
    4 ofertas

    ...to them. We are seeking a company to finalise what they cannot. We have given them ample opportunity and they have failed miserably. It is not a complex app and a first version was completed but needed many improvements. They failed to provided a successful working edition of the improved version. I can provide further details for those that might

    €615 (Avg Bid)
    €615 Média
    50 ofertas

    Hello, I have a virtual machine windows, I install virtual dj but I have a problem with the sound card and direct X. Direct X failed to [fazer login para ver a URL] install the correct driver for your video card Thank you

    €22 (Avg Bid)
    €22 Média
    3 ofertas

    I have 15 log groups with multiple log streams. I can already retrieve information from 1 log group and multiple log streams using a filter pattern. What I want to do it automate this so that for the last week, I can execute a script that will retrieve 3 to 5 terms occurring in all the logs. We can use a for loop wrapper around the CloudWatch query.

    €216 (Avg Bid)
    €216 Média
    5 ofertas

    When I try to access my WordPress admin url I get this php error: Re: {100-4264464} public_html/wp-admin/[fazer login para ver a URL]): failed to open stream: No such file or directory in /home/lionscreativeweb/public_html/wp-admin/[fazer login para ver a URL] on line 17 Fix any other errors. $10 to $20 max.

    €17 (Avg Bid)
    €17 Média
    42 ofertas

    After adding Photo-viewer plugin, cannot build android version with Ionic project. Here's error log. $ ionic cordova build --release android ... BUILD FAILED in 12s 27 actionable tasks: 27 executed /.../platforms/android/gradlew: Command failed with exit code 1 Error output: Note: Some input files use or override a deprecated API. Note: Recompile with

    €31 (Avg Bid)
    €31 Média
    12 ofertas

    Please watch the following video. My translation file is full from Vietnamese to Japanese. But when clicking on the "edit information" link or other links below, you will be jumping back to the Vietnamese page. I want to go to Japanese page if I am in Japanese page. The translation file has already translated all but it doesn't show up but goes back

    €22 (Avg Bid)
    €22 Média
    3 ofertas

    After the latest Wordpress update we are not able to update pages, it always says "Failed to update". Also, need help with the Google Maps API Key.

    €23 (Avg Bid)
    €23 Média
    25 ofertas

    Mail delivery message failed error We are getting mailed delivery message failed when customer place there orders. Customers are not getting email confirmation this was working fine before however since change to vps dedicated server no email confirmation being received. This can be quick fix but not sure where to look. Thanks

    €21 (Avg Bid)
    €21 Média
    26 ofertas
    €26 Média
    16 ofertas

    the MySQL service has issues it keeps crashing on start and corrupting tables when restarted in repair mode it works, but as soon as repair mode is removed, and MySQL starts again, it crashes again

    €11 / hr (Avg Bid)
    €11 / hr Média
    18 ofertas

    ...long time and for 5 out of 7 pages on the server php is working normally. But with 2 pages i have the following problem : FastCGI: failed to connect to server "/var/www/php-fpm/name/[fazer login para ver a URL]": connect() failed FastCGI: incomplete headers (0 bytes) received from server "/var/www/php-fpm/name/[fazer login para ver a URL]" Looking for someone...

    €28 (Avg Bid)
    €28 Média
    15 ofertas

    i need how to get 503 instead of any other failure code change it all to 503

    €20 (Avg Bid)
    €20 Média
    4 ofertas

    captcha will stop working if captcha is validated on the form but the validation of the form is triggered after the captcha validation is done.

    €20 (Avg Bid)
    €20 Média
    24 ofertas

    ...UMAP uses `numba` package, I got a problem with resolving types. Here is the error shown. ipdb> [fazer login para ver a URL]([fazer login para ver a URL]([fazer login para ver a URL][0], -1)) *** [fazer login para ver a URL]: Failed in nopython mode pipeline (step: nopython frontend) ...

    €107 (Avg Bid)
    €107 Média
    7 ofertas

    good day I have a new magento 2 webshop that did not want to mail I have tried this This module works only with Magento 2.2.4/2.2.5 versions and need to be removed after upgrade/downgrade. Assumed that the issue will be fixed in the new release. 1. How to install module Install via composer Run the following command in Magento 2 root folder: composer require sashas/bug-from-email php bin/mage...

    €180 (Avg Bid)
    €180 Média
    13 ofertas

    trying to upload productos to magento and i cant because i got this error after 70 seconds. ************ Error 503 Backend fetch failed Backend fetch failed Guru Meditation: XID: 1999504 Varnish cache server ******** also need to be checked timeout limits

    €19 (Avg Bid)
    €19 Média
    15 ofertas

    Magento Cron script readiness check failed

    €23 (Avg Bid)
    €23 Média
    15 ofertas

    I need node js and MongoDB on the amazon ec2. I have installed the node js and MongoDB. But Because of some reason, MongoDB is not able to connect. I need help from MongoDB admin who can help me in configuring MongoDB on aws ec2 instance. Please bid Only, if you are comfortable in working on a shared screen. I won't be able to give aws credential to you.

    €23 (Avg Bid)
    €23 Média
    3 ofertas

    The application is failing cert verification for custom CA signed vcertificates

    €11 (Avg Bid)
    €11 Média
    1 ofertas

    Hallo, My name is Alex. I have two small projects that I have built in Rhino and Houdini to 3D print. However, I am having trouble ...unshared edges) Do you have some experience in Houdini? I will need these issues resolved ready for printing. I will also have more projects coming up so it would be good to find someone to work with. All the best, Alex

    €19 / hr (Avg Bid)
    €19 / hr Média
    10 ofertas

    I am using mac osx high sierra. I get this error when i start a app "Creation failed: Unable to find Chrome executable" searchcode: [fazer login para ver a URL] Thank you.

    €24 (Avg Bid)
    €24 Média
    2 ofertas

    C# project error Precondition Failed error on HTTP request Please bid if you know the problem : Max budget 15$

    €18 (Avg Bid)
    €18 Média
    5 ofertas

    Hello...application which connects to our websites mariadb for exchanging license information. But from few days we are getting above mentioned error. So we need to solve this quickly and urgently. So I have attached source file where error is occurs and if you need to debug whole source code then it can be done through teamviewer on my pc. Thank you.

    €2 / hr (Avg Bid)
    €2 / hr Média
    1 ofertas

    Hello, When moving from one hosting to an other, my gallery2 script has been moved but don't work. I need help to fix this. Only apply if you know gallery2 script : [fazer login para ver a URL] Tx

    €32 (Avg Bid)
    €32 Média
    17 ofertas

    It's failed to upload the image in the post as attached. Reminder: The uploaded file could not be moved to wp-content/uploads/2018/09. The folder writing is 755. It's okay to upload the image if I set the folder as 777.

    €20 (Avg Bid)
    €20 Média
    37 ofertas

    [fazer login para ver a URL] [fazer login para ver a URL] The apps above (same platform) are getting the "handshake failed" error for users of android 7.0. I need someone to fix this error for me on either the server or app side. I prefer a fix on the server side if possible.

    €155 (Avg Bid)
    €155 Média
    18 ofertas

    we have a php mysql server running on the server and its used by our devices to send attendance data. When I use df command, the output says 61% disk is used but df -i shows 100% Inodes used. It shouldn't more than one hour job for someone who knows the stuff

    €107 (Avg Bid)
    €107 Média
    7 ofertas

    From UI I would like to see an option for the user to select “re run failures”. If selected, when the original test set completes, we should automatically compile the test cases which were logged as FAIL, and automatically re-run FAIL test cases

    €219 (Avg Bid)
    €219 Média
    5 ofertas

    After Restarting nginx (via systemctl): Job for [fazer login para ver a URL] failed because the control process exited with error code. See "systemctl status [fazer login para ver a URL]" and "jo urnalctl -xe" for details. Full written sinstractions how can we fix this issue in the future.

    €28 (Avg Bid)
    €28 Média
    17 ofertas

    i have problem with my outlook. it seems very easy but i dont want make something wrong Failed to register VB Script DLL .. its says Reinstall or run Regsvr32,exe [fazer login para ver a URL] to self register.

    €34 (Avg Bid)
    €34 Média
    3 ofertas

    I have a website down, and it's spitting this error. PHP Fatal error: require(): Failed opening required '/home2/officeca/public_html/wp-includes/rest-api/endpoints/[fazer login para ver a URL]' (include_path='.:/opt/alt/php70/usr/share/pear') in /home2/officeca/public_html/[fazer login para ver a URL] on line 238 Thanks!

    €22 (Avg Bid)
    €22 Média
    52 ofertas

    Good day freelancers, This is a super easy project for the right candidate. My GeForece Experience says that "A supported g...super easy project for the right candidate. My GeForece Experience says that "A supported game is required to use this feature" and the followed by "Your broadcast to twitch failed". I'm looking for someone to solve it for me.

    €4 / hr (Avg Bid)
    €4 / hr Média
    6 ofertas

    We use bitbucket for repository. In the pipeline to deploy the code to another server, it reports the following error. It seems there's We need an expert in Laravel to help fix the issue. It seems we need to deploy project from scratch installing all dependencies? After this, we hope to establish long term collaborations. <1s + ssh -p 9222 -o

    €32 (Avg Bid)
    €32 Média
    27 ofertas

    This is quite a small, quick project. I have a file that I am trying to run a CFD on through ANSYS that I need quite urgently, however when I try and mesh the file I get the error: "One or more entities failed to mesh. The mesh of the bodies containing these entities may not be up-to-date. However, meshing might be successful on the other entities"

    €18 / hr (Avg Bid)
    €18 / hr Média
    17 ofertas

    This is quite a small, quick project. I have a file that I am trying to run a CFD on through ANSYS that I need quite urgently, however when I try and mesh the file I get the error: "One or more entities failed to mesh. The mesh of the bodies containing these entities may not be up-to-date. However, meshing might be successful on the other entities"

    €89 (Avg Bid)
    €89 Média
    30 ofertas

    Redirect folder "Can not create folder "ServerNameRedirected_User_FilesUserNameDesktop" Error details: "Access is denied. OS: Windows 7 x64

    €109 (Avg Bid)
    €109 Média
    37 ofertas

    Hello, i uploads media file to uploads folder on FTP but i still dont see it in media libelary, in article its work correctly- images inside article, but i cant see attachment images so i try to import media from Wodpres importer. at first i try to import time range for example 2-3 month but i see i got some error - it sounds like timeout becouse i

    €35 (Avg Bid)
    Garantido
    €35
    5 inscrições

    You can see the error here: [fazer login para ver a URL] Site uses Yii, PHP and Mysql

    €22 (Avg Bid)
    €22 Média
    10 ofertas

    import via plesk Job for [fazer login para ver a URL] failed because the control process exited with error code. See "systemctl status [fazer login para ver a URL]" and "journalctl -xe" for details. Unable to import the database_new dump: ERROR 1062 (23000) at line 12478: Duplicate entry 'i breeze 500 [0,127970,129113] -> [N] POST [fazer login para...

    €47 (Avg Bid)
    €47 Média
    14 ofertas

    import via plesk Job for [fazer login para ver a URL] failed because the control process exited with error code. See "systemctl status [fazer login para ver a URL]" and "journalctl -xe" for details. Unable to import the database_new dump: ERROR 1062 (23000) at line 12478: Duplicate entry 'i breeze 500 [0,127970,129113] -> [N] POST [fazer login para...

    €26 (Avg Bid)
    €26 Média
    4 ofertas

    [fazer login para ver a URL] is getting a "secure connection failed" error for some browsers: see: [fazer login para ver a URL]://[fazer login para ver a URL] I need help to fix this issue.

    €86 (Avg Bid)
    €86 Média
    40 ofertas

    Only need fixe for gradle 4.4 synchronization . and build apps complete show on ui . just fixed it . if you are experience on it it just less than 20 mins . thank you

    €18 / hr (Avg Bid)
    €18 / hr Média
    11 ofertas

    Hey! Can someone help me with this error? I am not able to start my react-native app. Android studio shows this error: "Failed to resolve: react-native" If I start the react-native app with the console, the error "Execution failed for task ':app:processDebugResources'." appears.

    €5 / hr (Avg Bid)
    €5 / hr Média
    20 ofertas

    Error: /project/gradlew: Command failed with exit code 1 Error output: FAILURE: Build failed with an exception. A problem occurred configuring root project 'project'. Here is the exact error: Could not find [fazer login para ver a URL] ([fazer login para ver a URL]:play-services-auth-base-license:11.8.0). Searched in the following locations wi...

    €14 / hr (Avg Bid)
    €14 / hr Média
    5 ofertas